Deal of the Day

Home » Main » Manning Forums » 2008 » ActiveMQ in Action

Thread: The POM for woodstox:wstx-asl:jar:3.2.7 is missing

Reply to this Thread Reply to this Thread Search Forum Search Forum Back to Thread List Back to Thread List

Permlink Replies: 1 - Pages: 1 - Last Post: Jun 17, 2012 12:30 PM by: rlou
rlou

Posts: 2
From: USA
Registered: 6/16/12
The POM for woodstox:wstx-asl:jar:3.2.7 is missing
Posted: Jun 16, 2012 6:59 PM
  Click to reply to this thread Reply

It took me hours to finally make it work for [mvn clean install] command! However I noticed this warning message at the beginning - "The POM for woodstox:wstx-asl:jar:3.2.7 is missing, no dependency information is available". I found out from maven repository that woodstox-asl only comes up to 3.2.0. But if i modified it in pom.xml, it will give me the following error even though it:downloaded woodstox 3.2.0 successfully:

C:\JAVA\PROJECTS_MAVEN\others\amq-in-action-example-src>mvn clean install -e
[INFO] Error stacktraces are turned on.
[INFO] Scanning for projects...
[INFO]
[INFO] ------------------------------------------------------------------------
[INFO] Building ActiveMQ in Action Examples 1.0-SNAPSHOT
[INFO] ------------------------------------------------------------------------
Downloading: http://download.java.net/maven/2/woodstox/wstx-asl/3.2.0/wstx-asl-3.2.0.pom
Downloading: http://repo.maven.apache.org/maven2/woodstox/wstx-asl/3.2.0/wstx-asl-3.2.0.pom
[WARNING] Could not transfer metadata org.springframework:spring-core/maven-metadata.xml from/to m1.dev.java.net (http://download.java.net/maven/1): No connector available to access repository m1.dev.
java.net (http://download.java.net/maven/1) of type legacy using the available factories WagonRepositoryConnectorFactory
[WARNING] Could not transfer metadata org.springframework:spring/maven-metadata.xml from/to m1.dev.java.net (http://download.java.net/maven/1): No connector available to access repository m1.dev.java.
net (http://download.java.net/maven/1) of type legacy using the available factories WagonRepositoryConnectorFactory
[WARNING] Could not transfer metadata org.springframework:spring-beans/maven-metadata.xml from/to m1.dev.java.net (http://download.java.net/maven/1): No connector available to access repository m1.dev
.java.net (http://download.java.net/maven/1) of type legacy using the available factories WagonRepositoryConnectorFactory
[WARNING] Could not transfer metadata org.springframework:spring-context/maven-metadata.xml from/to m1.dev.java.net (http://download.java.net/maven/1): No connector available to access repository m1.d
ev.java.net (http://download.java.net/maven/1) of type legacy using the available factories WagonRepositoryConnectorFactory
[WARNING] Could not transfer metadata org.springframework:spring-web/maven-metadata.xml from/to m1.dev.java.net (http://download.java.net/maven/1): No connector available to access repository m1.dev.j
ava.net (http://download.java.net/maven/1) of type legacy using the available factories WagonRepositoryConnectorFactory
[INFO] ------------------------------------------------------------------------
[INFO] BUILD FAILURE
[INFO] ------------------------------------------------------------------------
[INFO] Total time: 4.297s
[INFO] Finished at: Sat Jun 16 16:51:57 PDT 2012
[INFO] Final Memory: 7M/17M
[INFO] ------------------------------------------------------------------------
[ERROR] Failed to execute goal on project activemq-in-action-examples: Could not resolve dependencies for project org.apache.activemq.book:activemq-in-action-examples:jar:1.0-SNAPSHOT: Failed to colle
ct dependencies for [junit:junit:jar:4.4 (test), org.apache.activemq:activemq-core:jar:5.3.2 (compile), org.apache.geronimo.specs:geronimo-jms_1.1_spec:jar:1.1 (compile), org.apache.geronimo.specs:ger
onimo-j2ee-management_1.0_spec:jar:1.1 (compile), org.apache.activemq:activemq-optional:jar:5.3.2 (compile), org.apache.activemq:activemq-pool:jar:5.3.2 (compile), org.springframework:spring:jar:2.5.6
(compile), org.apache.xbean:xbean-spring:jar:3.4.3 (compile), stax:stax-api:jar:1.0.1 (compile), woodstox:wstx-asl:jar:3.2.0 (compile), org.apache.activemq:activemq-camel:jar:5.3.2 (compile), org.apa
che.camel:camel-jms:jar:2.0.0 (compile), org.apache.camel:camel-web:jar:classes:2.0.0 (compile), org.apache.camel:camel-core:jar:2.0.0 (compile), org.apache.camel:camel-spring:jar:2.0.0 (compile), com
mons-logging:commons-logging:jar:1.1.1 (compile), log4j:log4j:jar:1.2.14 (compile)]: Failed to read artifact descriptor for woodstox:wstx-asl:jar:3.2.0: Could not transfer artifact woodstox:wstx-asl:p
om:3.2.0 from/to java.net (http://download.java.net/maven/2): Connection to http://download.java.net refused: Connection refused: connect -> [Help 1]
org.apache.maven.lifecycle.LifecycleExecutionException: Failed to execute goal on project activemq-in-action-examples: Could not resolve dependencies for project org.apache.activemq.book:activemq-in-a
ction-examples:jar:1.0-SNAPSHOT: Failed to collect dependencies for [junit:junit:jar:4.4 (test), org.apache.activemq:activemq-core:jar:5.3.2 (compile), org.apache.geronimo.specs:geronimo-jms_1.1_spec:
jar:1.1 (compile), org.apache.geronimo.specs:geronimo-j2ee-management_1.0_spec:jar:1.1 (compile), org.apache.activemq:activemq-optional:jar:5.3.2 (compile), org.apache.activemq:activemq-pool:jar:5.3.2
(compile), org.springframework:spring:jar:2.5.6 (compile), org.apache.xbean:xbean-spring:jar:3.4.3 (compile), stax:stax-api:jar:1.0.1 (compile), woodstox:wstx-asl:jar:3.2.0 (compile), org.apache.acti
vemq:activemq-camel:jar:5.3.2 (compile), org.apache.camel:camel-jms:jar:2.0.0 (compile), org.apache.camel:camel-web:jar:classes:2.0.0 (compile), org.apache.camel:camel-core:jar:2.0.0 (compile), org.ap
ache.camel:camel-spring:jar:2.0.0 (compile), commons-logging:commons-logging:jar:1.1.1 (compile), log4j:log4j:jar:1.2.14 (compile)]
at org.apache.maven.lifecycle.internal.LifecycleDependencyResolver.getDependencies(LifecycleDependencyResolver.java:210)
at org.apache.maven.lifecycle.internal.LifecycleDependencyResolver.resolveProjectDependencies(LifecycleDependencyResolver.java:117)
at org.apache.maven.lifecycle.internal.MojoExecutor.ensureDependenciesAreResolved(MojoExecutor.java:258)
at org.apache.maven.lifecycle.internal.MojoExecutor.execute(MojoExecutor.java:201)
at org.apache.maven.lifecycle.internal.MojoExecutor.execute(MojoExecutor.java:153)
at org.apache.maven.lifecycle.internal.MojoExecutor.execute(MojoExecutor.java:145)
at org.apache.maven.lifecycle.internal.LifecycleModuleBuilder.buildProject(LifecycleModuleBuilder.java:84)
at org.apache.maven.lifecycle.internal.LifecycleModuleBuilder.buildProject(LifecycleModuleBuilder.java:59)
at org.apache.maven.lifecycle.internal.LifecycleStarter.singleThreadedBuild(LifecycleStarter.java:183)
at org.apache.maven.lifecycle.internal.LifecycleStarter.execute(LifecycleStarter.java:161)
at org.apache.maven.DefaultMaven.doExecute(DefaultMaven.java:320)
at org.apache.maven.DefaultMaven.execute(DefaultMaven.java:156)
at org.apache.maven.cli.MavenCli.execute(MavenCli.java:537)
at org.apache.maven.cli.MavenCli.doMain(MavenCli.java:196)
at org.apache.maven.cli.MavenCli.main(MavenCli.java:141)
at sun.reflect.NativeMethodAccessorImpl.invoke0(Native Method)
at sun.reflect.NativeMethodAccessorImpl.invoke(NativeMethodAccessorImpl.java:39)
at sun.reflect.DelegatingMethodAccessorImpl.invoke(DelegatingMethodAccessorImpl.java:25)
at java.lang.reflect.Method.invoke(Method.java:597)
at org.codehaus.plexus.classworlds.launcher.Launcher.launchEnhanced(Launcher.java:290)
at org.codehaus.plexus.classworlds.launcher.Launcher.launch(Launcher.java:230)
at org.codehaus.plexus.classworlds.launcher.Launcher.mainWithExitCode(Launcher.java:409)
at org.codehaus.plexus.classworlds.launcher.Launcher.main(Launcher.java:352)
Caused by: org.apache.maven.project.DependencyResolutionException: Could not resolve dependencies for project org.apache.activemq.book:activemq-in-action-examples:jar:1.0-SNAPSHOT: Failed to collect d
ependencies for [junit:junit:jar:4.4 (test), org.apache.activemq:activemq-core:jar:5.3.2 (compile), org.apache.geronimo.specs:geronimo-jms_1.1_spec:jar:1.1 (compile), org.apache.geronimo.specs:geronim
o-j2ee-management_1.0_spec:jar:1.1 (compile), org.apache.activemq:activemq-optional:jar:5.3.2 (compile), org.apache.activemq:activemq-pool:jar:5.3.2 (compile), org.springframework:spring:jar:2.5.6 (co
mpile), org.apache.xbean:xbean-spring:jar:3.4.3 (compile), stax:stax-api:jar:1.0.1 (compile), woodstox:wstx-asl:jar:3.2.0 (compile), org.apache.activemq:activemq-camel:jar:5.3.2 (compile), org.apache.
camel:camel-jms:jar:2.0.0 (compile), org.apache.camel:camel-web:jar:classes:2.0.0 (compile), org.apache.camel:camel-core:jar:2.0.0 (compile), org.apache.camel:camel-spring:jar:2.0.0 (compile), commons
-logging:commons-logging:jar:1.1.1 (compile), log4j:log4j:jar:1.2.14 (compile)]
at org.apache.maven.project.DefaultProjectDependenciesResolver.resolve(DefaultProjectDependenciesResolver.java:158)
at org.apache.maven.lifecycle.internal.LifecycleDependencyResolver.getDependencies(LifecycleDependencyResolver.java:185)
... 22 more
Caused by: org.sonatype.aether.collection.DependencyCollectionException: Failed to collect dependencies for [junit:junit:jar:4.4 (test), org.apache.activemq:activemq-core:jar:5.3.2 (compile), org.apac
he.geronimo.specs:geronimo-jms_1.1_spec:jar:1.1 (compile), org.apache.geronimo.specs:geronimo-j2ee-management_1.0_spec:jar:1.1 (compile), org.apache.activemq:activemq-optional:jar:5.3.2 (compile), org
.apache.activemq:activemq-pool:jar:5.3.2 (compile), org.springframework:spring:jar:2.5.6 (compile), org.apache.xbean:xbean-spring:jar:3.4.3 (compile), stax:stax-api:jar:1.0.1 (compile), woodstox:wstx-
asl:jar:3.2.0 (compile), org.apache.activemq:activemq-camel:jar:5.3.2 (compile), org.apache.camel:camel-jms:jar:2.0.0 (compile), org.apache.camel:camel-web:jar:classes:2.0.0 (compile), org.apache.came
l:camel-core:jar:2.0.0 (compile), org.apache.camel:camel-spring:jar:2.0.0 (compile), commons-logging:commons-logging:jar:1.1.1 (compile), log4j:log4j:jar:1.2.14 (compile)]
at org.sonatype.aether.impl.internal.DefaultDependencyCollector.collectDependencies(DefaultDependencyCollector.java:258)
at org.sonatype.aether.impl.internal.DefaultRepositorySystem.collectDependencies(DefaultRepositorySystem.java:308)
at org.apache.maven.project.DefaultProjectDependenciesResolver.resolve(DefaultProjectDependenciesResolver.java:150)
... 23 more
Caused by: org.sonatype.aether.resolution.ArtifactDescriptorException: Failed to read artifact descriptor for woodstox:wstx-asl:jar:3.2.0
at org.apache.maven.repository.internal.DefaultArtifactDescriptorReader.loadPom(DefaultArtifactDescriptorReader.java:296)
at org.apache.maven.repository.internal.DefaultArtifactDescriptorReader.readArtifactDescriptor(DefaultArtifactDescriptorReader.java:186)
at org.sonatype.aether.impl.internal.DefaultDependencyCollector.process(DefaultDependencyCollector.java:412)
at org.sonatype.aether.impl.internal.DefaultDependencyCollector.collectDependencies(DefaultDependencyCollector.java:240)
... 25 more
Caused by: org.sonatype.aether.resolution.ArtifactResolutionException: Could not transfer artifact woodstox:wstx-asl:pom:3.2.0 from/to java.net (http://download.java.net/maven/2): Connection to http:/
/download.java.net refused
at org.sonatype.aether.impl.internal.DefaultArtifactResolver.resolve(DefaultArtifactResolver.java:538)
at org.sonatype.aether.impl.internal.DefaultArtifactResolver.resolveArtifacts(DefaultArtifactResolver.java:216)
at org.sonatype.aether.impl.internal.DefaultArtifactResolver.resolveArtifact(DefaultArtifactResolver.java:193)
at org.apache.maven.repository.internal.DefaultArtifactDescriptorReader.loadPom(DefaultArtifactDescriptorReader.java:281)
... 28 more
Caused by: org.sonatype.aether.transfer.ArtifactTransferException: Could not transfer artifact woodstox:wstx-asl:pom:3.2.0 from/to java.net (http://download.java.net/maven/2): Connection to http://dow
nload.java.net refused
at org.sonatype.aether.connector.wagon.WagonRepositoryConnector$4.wrap(WagonRepositoryConnector.java:951)
at org.sonatype.aether.connector.wagon.WagonRepositoryConnector$4.wrap(WagonRepositoryConnector.java:941)
at org.sonatype.aether.connector.wagon.WagonRepositoryConnector$GetTask.run(WagonRepositoryConnector.java:669)
at org.sonatype.aether.util.concurrency.RunnableErrorForwarder$1.run(RunnableErrorForwarder.java:60)
at java.util.concurrent.ThreadPoolExecutor$Worker.runTask(ThreadPoolExecutor.java:886)
at java.util.concurrent.ThreadPoolExecutor$Worker.run(ThreadPoolExecutor.java:908)
at java.lang.Thread.run(Thread.java:662)
Caused by: org.apache.maven.wagon.TransferFailedException: Connection to http://download.java.net refused
at org.apache.maven.wagon.shared.http4.AbstractHttpClientWagon.fillInputData(AbstractHttpClientWagon.java:799)
at org.apache.maven.wagon.StreamWagon.getInputStream(StreamWagon.java:116)
at org.apache.maven.wagon.StreamWagon.getIfNewer(StreamWagon.java:88)
at org.apache.maven.wagon.StreamWagon.get(StreamWagon.java:61)
at org.sonatype.aether.connector.wagon.WagonRepositoryConnector$GetTask.run(WagonRepositoryConnector.java:601)
... 4 more
Caused by: org.apache.maven.wagon.providers.http.httpclient.conn.HttpHostConnectException: Connection to http://download.java.net refused
at org.apache.maven.wagon.providers.http.httpclient.impl.conn.DefaultClientConnectionOperator.openConnection(DefaultClientConnectionOperator.java:158)
at org.apache.maven.wagon.providers.http.httpclient.impl.conn.AbstractPoolEntry.open(AbstractPoolEntry.java:149)
at org.apache.maven.wagon.providers.http.httpclient.impl.conn.AbstractPooledConnAdapter.open(AbstractPooledConnAdapter.java:121)
at org.apache.maven.wagon.providers.http.httpclient.impl.client.DefaultRequestDirector.tryConnect(DefaultRequestDirector.java:573)
at org.apache.maven.wagon.providers.http.httpclient.impl.client.DefaultRequestDirector.execute(DefaultRequestDirector.java:425)
at org.apache.maven.wagon.providers.http.httpclient.impl.client.AbstractHttpClient.execute(AbstractHttpClient.java:820)
at org.apache.maven.wagon.providers.http.httpclient.impl.client.AbstractHttpClient.execute(AbstractHttpClient.java:754)
at org.apache.maven.wagon.shared.http4.AbstractHttpClientWagon.execute(AbstractHttpClientWagon.java:674)
at org.apache.maven.wagon.shared.http4.AbstractHttpClientWagon.fillInputData(AbstractHttpClientWagon.java:793)
... 8 more
Caused by: java.net.ConnectException: Connection refused: connect
at java.net.PlainSocketImpl.socketConnect(Native Method)
at java.net.PlainSocketImpl.doConnect(PlainSocketImpl.java:351)
at java.net.PlainSocketImpl.connectToAddress(PlainSocketImpl.java:213)
at java.net.PlainSocketImpl.connect(PlainSocketImpl.java:200)
at java.net.SocksSocketImpl.connect(SocksSocketImpl.java:366)
at java.net.Socket.connect(Socket.java:529)
at org.apache.maven.wagon.providers.http.httpclient.conn.scheme.PlainSocketFactory.connectSocket(PlainSocketFactory.java:123)
at org.apache.maven.wagon.providers.http.httpclient.impl.conn.DefaultClientConnectionOperator.openConnection(DefaultClientConnectionOperator.java:148)
... 16 more
[ERROR]
[ERROR] Re-run Maven using the -X switch to enable full debug logging.
[ERROR]
[ERROR] For more information about the errors and possible solutions, please read the following articles:
[ERROR] [Help 1] http://cwiki.apache.org/confluence/display/MAVEN/DependencyResolutionException
C:\JAVA\PROJECTS_MAVEN\others\amq-in-action-example-src>

rlou

Posts: 2
From: USA
Registered: 6/16/12
Re: The POM for woodstox:wstx-asl:jar:3.2.7 is missing (one down)
Posted: Jun 17, 2012 12:30 PM   in response to: rlou in response to: rlou
  Click to reply to this thread Reply

I probably figured it out by myself: woodstox version 3.2.7 does exist but the groupId in dependency should be "org.codehaus.woodstox" instead of just "woodstox" the complete dependency tag and all the sub tags under <properties> are listed below:

<activemq-version>5.3.2</activemq-version>
<camel-version>2.0.0</camel-version>
<commons-logging-version>1.1.1</commons-logging-version>
<commons-pool-version>1.4</commons-pool-version>
<geronimo-spec-version>1.1</geronimo-spec-version>
<junit-version>4.4</junit-version>
<log4j-version>1.2.14</log4j-version>
<springframework-version>2.5.6</springframework-version>
<stax-version>1.0.1</stax-version>
<woodstox-version>3.2.7</woodstox-version>
<xbean-version>3.4.3</xbean-version>

<dependency>
<groupId>org.codehaus.woodstox</groupId>
<artifactId>wstx-asl</artifactId>
<version>${woodstox-version}</version>
</dependency>

However, i still cannot resolve the warning issue about not able to transfer the metadata org.springframework:spring/maven-metadata.xml from/to m1.dev.java.net...
I am listing the result from the "svn clean install -e" command below for your reference. I don't know if it has anything to do with xbean or nexus. I am new about maven and activemq. I am just making a wild guess. Thanks!
------------------------------------------------------------------------
[WARNING] Could not transfer metadata org.springframework:spring/maven-metadata.xml from/to m1.dev.java.net (http://download.java.net/maven/1): No connector available to access repository m1.dev.java.
-------------------------------------------------------------------------

C:\JAVA\PROJECTS_MAVEN\others\amq-in-action-example-src>mvn clean install -e
[INFO] Error stacktraces are turned on.
[INFO] Scanning for projects...
[INFO]
[INFO] ------------------------------------------------------------------------
[INFO] Building ActiveMQ in Action Examples 1.0-SNAPSHOT
[INFO] ------------------------------------------------------------------------
[WARNING] Could not transfer metadata org.springframework:spring-core/maven-metadata.xml from/to m1.dev.java.net (http://download.java.net/maven/1): No connector available to access repository m1.dev.
java.net (http://download.java.net/maven/1) of type legacy using the available factories WagonRepositoryConnectorFactory
[WARNING] Could not transfer metadata org.springframework:spring/maven-metadata.xml from/to m1.dev.java.net (http://download.java.net/maven/1): No connector available to access repository m1.dev.java.
net (http://download.java.net/maven/1) of type legacy using the available factories WagonRepositoryConnectorFactory
[WARNING] Could not transfer metadata org.springframework:spring-beans/maven-metadata.xml from/to m1.dev.java.net (http://download.java.net/maven/1): No connector available to access repository m1.dev
.java.net (http://download.java.net/maven/1) of type legacy using the available factories WagonRepositoryConnectorFactory
[WARNING] Could not transfer metadata org.springframework:spring-context/maven-metadata.xml from/to m1.dev.java.net (http://download.java.net/maven/1): No connector available to access repository m1.d
ev.java.net (http://download.java.net/maven/1) of type legacy using the available factories WagonRepositoryConnectorFactory
[WARNING] Could not transfer metadata org.springframework:spring-web/maven-metadata.xml from/to m1.dev.java.net (http://download.java.net/maven/1): No connector available to access repository m1.dev.j
ava.net (http://download.java.net/maven/1) of type legacy using the available factories WagonRepositoryConnectorFactory
[INFO]
[INFO] --- maven-clean-plugin:2.4.1:clean (default-clean) @ activemq-in-action-examples ---
[INFO] Deleting C:\JAVA\PROJECTS_MAVEN\others\amq-in-action-example-src\target
[INFO]
[INFO] --- maven-resources-plugin:2.5:resources (default-resources) @ activemq-in-action-examples ---
[debug] execute contextualize
[INFO] Using 'UTF-8' encoding to copy filtered resources.
[INFO] Copying 49 resources
[INFO]
[INFO] --- maven-compiler-plugin:2.4:compile (default-compile) @ activemq-in-action-examples ---
[INFO] Compiling 68 source files to C:\JAVA\PROJECTS_MAVEN\others\amq-in-action-example-src\target\classes
[INFO]
[INFO] --- maven-resources-plugin:2.5:testResources (default-testResources) @ activemq-in-action-examples ---
[debug] execute contextualize
[INFO] Using 'UTF-8' encoding to copy filtered resources.
[INFO] Copying 1 resource
[INFO]
[INFO] --- maven-compiler-plugin:2.4:testCompile (default-testCompile) @ activemq-in-action-examples ---
[INFO] Compiling 3 source files to C:\JAVA\PROJECTS_MAVEN\others\amq-in-action-example-src\target\test-classes
[INFO]
[INFO] --- maven-surefire-plugin:2.12:test (default-test) @ activemq-in-action-examples ---
[INFO] Surefire report directory: C:\JAVA\PROJECTS_MAVEN\others\amq-in-action-example-src\target\surefire-reports

-------------------------------------------------------
T E S T S
-------------------------------------------------------
Running org.apache.activemq.book.ch10.ScalingBrokerConfigTest
10:19:24,262 | INFO | Pre-instantiating singletons in org.springframework.beans.factory.support.DefaultListableBeanFactory@a17083: defining beans [org.springframework.beans.factory.config.PropertyPla
ceholderConfigurer#0,org.apache.activemq.xbean.XBeanBrokerService#0]; root of factory hierarchy
10:19:24,575 | INFO | Using Persistence Adapter: org.apache.activemq.store.kahadb.KahaDBPersistenceAdapter@111b910
10:19:24,590 | INFO | JMX consoles can connect to service:jmx:rmi:///jndi/rmi://localhost:1099/jmxrmi
10:19:24,653 | INFO | ActiveMQ 5.3.2 JMS Message Broker (amq-broker) is starting
10:19:24,653 | INFO | For help or more information please see: http://activemq.apache.org/
10:19:24,825 | INFO | Listening for connections at: nio://localhost:61616
10:19:24,825 | INFO | Connector openwire Started
10:19:24,825 | INFO | ActiveMQ JMS Message Broker (amq-broker, ID:LAJP67PM1-9222-1339953564668-0:0) started
10:19:24,887 | INFO | Successfully connected to tcp://localhost:61616
10:19:24,934 | INFO | Kaha Store using data directory target\data\amq-broker\tmp_storage
10:19:24,950 | INFO | ActiveMQ Message Broker (amq-broker, ID:LAJP67PM1-9222-1339953564668-0:0) is shutting down
10:19:26,887 | INFO | Connector openwire Stopped
10:19:27,137 | INFO | ActiveMQ JMS Message Broker (amq-broker, ID:LAJP67PM1-9222-1339953564668-0:0) stopped
Tests run: 1, Failures: 0, Errors: 0, Skipped: 0, Time elapsed: 3.234 sec
Running org.apache.activemq.book.ch11.CamelConfigTest
10:19:27,637 | INFO | Pre-instantiating singletons in org.springframework.beans.factory.support.DefaultListableBeanFactory@df2940: defining beans [org.springframework.beans.factory.config.PropertyPla
ceholderConfigurer#0,org.apache.activemq.xbean.XBeanBrokerService#0,template,consumerTemplate,camel:beanPostProcessor,camel,activemq]; root of factory hierarchy
10:19:27,653 | INFO | JMX consoles can connect to service:jmx:rmi:///jndi/rmi://localhost:1099/jmxrmi
10:19:27,653 | INFO | Using Persistence Adapter: MemoryPersistenceAdapter
10:19:27,653 | INFO | ActiveMQ 5.3.2 JMS Message Broker (testBroker) is starting
10:19:27,653 | INFO | For help or more information please see: http://activemq.apache.org/
10:19:27,653 | INFO | Installing StaticsBroker
10:19:27,653 | INFO | Starting StatisticsBroker
10:19:27,653 | INFO | Listening for connections at: tcp://localhost:61616
10:19:27,653 | INFO | Connector tcp://localhost:61616 Started
10:19:27,653 | INFO | ActiveMQ JMS Message Broker (testBroker, ID:LAJP67PM1-9222-1339953564668-0:1) started
10:19:27,965 | INFO | Connector vm://testBroker Started
10:19:28,059 | INFO | Successfully connected to tcp://localhost:61616
10:19:28,059 | INFO | ActiveMQ Message Broker (testBroker, ID:LAJP67PM1-9222-1339953564668-0:1) is shutting down
10:19:28,106 | WARN | Cannot determine specific JmsMessage type to use from body class. Will use generic JmsMessage. Body is null. If you want to send a POJO then your class might need to implement j
ava.io.Serializable, or you can force a specific type by setting the jmsMessageType option on the JMS endpoint.
10:19:30,059 | INFO | Connector tcp://localhost:61616 Stopped
10:19:30,059 | INFO | Connector vm://testBroker Stopped
10:19:30,059 | INFO | ActiveMQ JMS Message Broker (testBroker, ID:LAJP67PM1-9222-1339953564668-0:1) stopped
Tests run: 1, Failures: 0, Errors: 0, Skipped: 0, Time elapsed: 2.906 sec

Results :

Tests run: 2, Failures: 0, Errors: 0, Skipped: 0

[INFO]
[INFO] --- maven-jar-plugin:2.3.2:jar (default-jar) @ activemq-in-action-examples ---
[INFO] Building jar: C:\JAVA\PROJECTS_MAVEN\others\amq-in-action-example-src\target\activemq-in-action-examples.jar
[INFO]
[INFO] --- maven-assembly-plugin:2.3:single (example-src) @ activemq-in-action-examples ---
[INFO] Reading assembly descriptor: C:\JAVA\PROJECTS_MAVEN\others\amq-in-action-example-src/src/main/assembly/activemq-in-action-src.xml
[INFO] Building zip: C:\JAVA\PROJECTS_MAVEN\others\amq-in-action-example-src\target\activemq-in-action-examples-src.zip
[INFO]
[INFO] --- maven-install-plugin:2.3.1:install (default-install) @ activemq-in-action-examples ---
[INFO] Installing C:\JAVA\PROJECTS_MAVEN\others\amq-in-action-example-src\target\activemq-in-action-examples.jar to C:\WINDOWS\Profiles\rlou\.m2\repository\org\apache\activemq\book\activemq-in-action-
examples\1.0-SNAPSHOT\activemq-in-action-examples-1.0-SNAPSHOT.jar
[INFO] Installing C:\JAVA\PROJECTS_MAVEN\others\amq-in-action-example-src\pom.xml to C:\WINDOWS\Profiles\rlou\.m2\repository\org\apache\activemq\book\activemq-in-action-examples\1.0-SNAPSHOT\activemq-
in-action-examples-1.0-SNAPSHOT.pom
[INFO] Installing C:\JAVA\PROJECTS_MAVEN\others\amq-in-action-example-src\target\activemq-in-action-examples-src.zip to C:\WINDOWS\Profiles\rlou\.m2\repository\org\apache\activemq\book\activemq-in-act
ion-examples\1.0-SNAPSHOT\activemq-in-action-examples-1.0-SNAPSHOT-src.zip
[INFO] ------------------------------------------------------------------------
[INFO] BUILD SUCCESS
[INFO] ------------------------------------------------------------------------
[INFO] Total time: 18.000s
[INFO] Finished at: Sun Jun 17 10:19:36 PDT 2012
[INFO] Final Memory: 16M/39M
[INFO] ------------------------------------------------------------------------
C:\JAVA\PROJECTS_MAVEN\others\amq-in-action-example-src>

Legend
Gold: 300 + pts
Silver: 100 - 299 pts
Bronze: 25 - 99 pts
Manning Author
Manning Staff
Manning Developmental Editor